{"text_format":"3","workbook":"xlsx","n_sheets":5,"sheets":["■散布量計算シート","作業シート","車速表","吐出量表","追加登録"],"not_rendered":{"images":2,"macros":1,"defined_names":7,"comments":2},"read":"whole","date_system":"1900"}

{"sheet":"■散布量計算シート","index":0,"n_rows":62,"n_cols":12,"rows_kept":62,"merged":[[0,1,0,9],[1,5,1,7],[2,4,2,8],[4,3,4,4],[4,6,4,8],[6,3,6,11],[8,1,8,2],[8,3,8,5],[8,8,8,9],[10,1,10,10],[11,1,11,2],[13,1,13,2],[13,3,13,4],[15,1,15,2],[15,3,15,4],[15,11,16,11],[17,1,17,2],[19,3,19,11],[20,1,20,2],[21,1,26,1],[28,1,28,2],[29,1,29,2],[33,1,33,11],[34,1,34,2],[36,1,36,2],[36,3,36,4],[38,1,38,2],[38,3,38,4],[38,11,39,11],[40,1,40,2],[42,3,42,11],[43,1,43,2],[44,1,49,1],[51,1,51,2],[52,1,52,2],[55,1,55,11],[57,1,57,3],[57,6,57,11],[58,1,58,3],[58,6,58,11],[59,1,61,5],[59,6,59,11],[60,6,60,11],[61,6,61,11],[62,1,62,11]]}
[]
[{"$nulls":5},"散布量計算"]
[{"$nulls":4},"＜＜　金属製スイッチノズル　＞＞"]
[]
[null,"お客様","おところ",null,null,"お名前",{"$nulls":3},"様"]
[]
[null,"製品名","3S-"]
[]
[null,"計算担当者",{"$nulls":6},{"$f":"NOW()","v":"2024-11-22T14:46:47.200"},null,"作成"]
[]
[]
[null,"■散布条件-１"]
[]
[null,"栽培品目/圃場名",{"$nulls":4},"噴霧方向","噴板名称","ノズル個数","吐出量"]
[{"$nulls":9},{"$f":"作業シート!G17","v":{"v":0,"d":"0.0"}},{"$f":"IF($J$18>0,J15/$J$18,0)","v":{"v":0,"d":"0%"}}]
{"$rows_left_out":48}
{"sheet":"作業シート","index":1,"n_rows":50,"n_cols":24,"rows_kept":50,"hidden":true,"merged":[[2,2,2,10],[2,15,2,23],[4,0,4,1],[4,13,4,14],[5,0,10,0],[5,13,8,13],[9,13,10,13],[12,0,12,10],[13,0,13,4],[16,0,16,1],[17,0,17,1],[18,0,18,1],[19,13,19,14],[19,15,19,18],[19,20,19,21],[21,0,21,1],[21,13,21,14],[22,0,27,0],[22,13,25,13],[26,13,27,13],[28,0,28,1],[31,0,31,9],[32,0,32,4],[35,0,35,1],[36,0,36,1],[37,0,37,1],[38,13,38,14],[38,15,38,18],[38,20,38,21],[40,0,40,1],[40,13,40,14],[41,0,46,0],[41,13,44,13],[45,13,46,13],[47,0,47,1]]}
[]
[]
["製 品 名","3S-",{"$f":"■散布量計算シート!D7","v":0},{"$nulls":10},"製品名","3S-",{"$f":"■散布量計算シート!D7","v":0}]
[]
["エンジン回転数(rpm)",null,1600,1800,2000,2200,2400,2500,2600,2700,2800,null,null,"エンジン回転数(rpm)",null,1600,1800,2000,2200,2400,2500,2600,2700,2800]
["車速","低-1",{"$f":"G6*0.64","v":{"v":0,"d":"0.0"}},{"$f":"G6*0.72","v":{"v":0,"d":"0.0"}},{"$f":"G6*0.8","v":{"v":0,"d":"0.0"}},{"$f":"G6*0.88","v":{"v":0,"d":"0.0"}},{"$f":"IF(ISERROR(VLOOKUP($C$3,車速表!$A:$AE,2,FALSE))=TRUE,0,VLOOKUP($C$3,車速表!$A:$AE,2,FALSE))","v":{"v":0,"d":"0.0"}},{"$f":"IF(ISERROR(VLOOKUP($C$3,車速表!$A:$AE,3,FALSE))=TRUE,0,VLOOKUP($C$3,車速表!$A:$AE,3,FALSE))","v":{"v":0,"d":"0.0"}},{"$f":"IF(ISERROR(VLOOKUP($C$3,車速表!$A:$AE,4,FALSE))=TRUE,0,VLOOKUP($C$3,車速表!$A:$AE,4,FALSE))","v":{"v":0,"d":"0.0"}},{"$f":"IF(ISERROR(VLOOKUP($C$3,車速表!$A:$AE,5,FALSE))=TRUE,0,VLOOKUP($C$3,車速表!$A:$AE,5,FALSE))","v":{"v":0,"d":"0.0"}},{"$f":"IF(ISERROR(VLOOKUP($C$3,車速表!$A:$AE,6,FALSE))=TRUE,0,VLOOKUP($C$3,車速表!$A:$AE,6,FALSE))","v":{"v":0,"d":"0.0"}},null,null,"車速\n(km/h)","低-1",{"$f":"T6*0.64","v":{"v":0,"d":"0.0"}},{"$f":"T6*0.72","v":{"v":0,"d":"0.0"}},{"$f":"T6*0.8","v":{"v":0,"d":"0.0"}},{"$f":"T6*0.88","v":{"v":0,"d":"0.0"}},{"$f":"IF(ISERROR(VLOOKUP($C$3,車速表!$A:$AE,2,FALSE))=TRUE,0,VLOOKUP($C$3,車速表!$A:$AE,2,FALSE))","v":{"v":0,"d":"0.0"}},{"$f":"IF(ISERROR(VLOOKUP($C$3,車速表!$A:$AE,3,FALSE))=TRUE,0,VLOOKUP($C$3,車速表!$A:$AE,3,FALSE))","v":{"v":0,"d":"0.0"}},{"$f":"IF(ISERROR(VLOOKUP($C$3,車速表!$A:$AE,4,FALSE))=TRUE,0,VLOOKUP($C$3,車速表!$A:$AE,4,FALSE))","v":{"v":0,"d":"0.0"}},{"$f":"IF(ISERROR(VLOOKUP($C$3,車速表!$A:$AE,5,FALSE))=TRUE,0,VLOOKUP($C$3,車速表!$A:$AE,5,FALSE))","v":{"v":0,"d":"0.0"}},{"$f":"IF(ISERROR(VLOOKUP($C$3,車速表!$A:$AE,6,FALSE))=TRUE,0,VLOOKUP($C$3,車速表!$A:$AE,6,FALSE))","v":{"v":0,"d":"0.0"}}]
[null,"中-1",{"v":0,"d":"0.0"},{"v":0,"d":"0.0"},{"v":0,"d":"0.0"},{"v":0,"d":"0.0"},{"$f":"IF(ISERROR(VLOOKUP($C$3,車速表!$A:$AE,7,FALSE))=TRUE,0,VLOOKUP($C$3,車速表!$A:$AE,7,FALSE))","v":{"v":0,"d":"0.0"}},{"$f":"IF(ISERROR(VLOOKUP($C$3,車速表!$A:$AE,8,FALSE))=TRUE,0,VLOOKUP($C$3,車速表!$A:$AE,8,FALSE))","v":{"v":0,"d":"0.0"}},{"$f":"IF(ISERROR(VLOOKUP($C$3,車速表!$A:$AE,9,FALSE))=TRUE,0,VLOOKUP($C$3,車速表!$A:$AE,9,FALSE))","v":{"v":0,"d":"0.0"}},{"$f":"IF(ISERROR(VLOOKUP($C$3,車速表!$A:$AE,10,FALSE))=TRUE,0,VLOOKUP($C$3,車速表!$A:$AE,10,FALSE))","v":{"v":0,"d":"0.0"}},{"$f":"IF(ISERROR(VLOOKUP($C$3,車速表!$A:$AE,11,FALSE))=TRUE,0,VLOOKUP($C$3,車速表!$A:$AE,11,FALSE))","v":{"v":0,"d":"0.0"}},{"$nulls":3},"中-1",{"v":0,"d":"0.0"},{"v":0,"d":"0.0"},{"v":0,"d":"0.0"},{"v":0,"d":"0.0"},{"$f":"IF(ISERROR(VLOOKUP($C$3,車速表!$A:$AE,7,FALSE))=TRUE,0,VLOOKUP($C$3,車速表!$A:$AE,7,FALSE))","v":{"v":0,"d":"0.0"}},{"$f":"IF(ISERROR(VLOOKUP($C$3,車速表!$A:$AE,8,FALSE))=TRUE,0,VLOOKUP($C$3,車速表!$A:$AE,8,FALSE))","v":{"v":0,"d":"0.0"}},{"$f":"IF(ISERROR(VLOOKUP($C$3,車速表!$A:$AE,9,FALSE))=TRUE,0,VLOOKUP($C$3,車速表!$A:$AE,9,FALSE))","v":{"v":0,"d":"0.0"}},{"$f":"IF(ISERROR(VLOOKUP($C$3,車速表!$A:$AE,10,FALSE))=TRUE,0,VLOOKUP($C$3,車速表!$A:$AE,10,FALSE))","v":{"v":0,"d":"0.0"}},{"$f":"IF(ISERROR(VLOOKUP($C$3,車速表!$A:$AE,11,FALSE))=TRUE,0,VLOOKUP($C$3,車速表!$A:$AE,11,FALSE))","v":{"v":0,"d":"0.0"}}]
[null,"低-2",{"v":0,"d":"0.0"},{"v":0,"d":"0.0"},{"v":0,"d":"0.0"},{"v":0,"d":"0.0"},{"$f":"IF(ISERROR(VLOOKUP($C$3,車速表!$A:$AE,12,FALSE))=TRUE,0,VLOOKUP($C$3,車速表!$A:$AE,12,FALSE))","v":{"v":0,"d":"0.0"}},{"$f":"IF(ISERROR(VLOOKUP($C$3,車速表!$A:$AE,13,FALSE))=TRUE,0,VLOOKUP($C$3,車速表!$A:$AE,13,FALSE))","v":{"v":0,"d":"0.0"}},{"$f":"IF(ISERROR(VLOOKUP($C$3,車速表!$A:$AE,14,FALSE))=TRUE,0,VLOOKUP($C$3,車速表!$A:$AE,14,FALSE))","v":{"v":0,"d":"0.0"}},{"$f":"IF(ISERROR(VLOOKUP($C$3,車速表!$A:$AE,15,FALSE))=TRUE,0,VLOOKUP($C$3,車速表!$A:$AE,15,FALSE))","v":{"v":0,"d":"0.0"}},{"$f":"IF(ISERROR(VLOOKUP($C$3,車速表!$A:$AE,16,FALSE))=TRUE,0,VLOOKUP($C$3,車速表!$A:$AE,16,FALSE))","v":{"v":0,"d":"0.0"}},{"$nulls":3},"低-2",{"v":0,"d":"0.0"},{"v":0,"d":"0.0"},{"v":0,"d":"0.0"},{"v":0,"d":"0.0"},{"$f":"IF(ISERROR(VLOOKUP($C$3,車速表!$A:$AE,12,FALSE))=TRUE,0,VLOOKUP($C$3,車速表!$A:$AE,12,FALSE))","v":{"v":0,"d":"0.0"}},{"$f":"IF(ISERROR(VLOOKUP($C$3,車速表!$A:$AE,13,FALSE))=TRUE,0,VLOOKUP($C$3,車速表!$A:$AE,13,FALSE))","v":{"v":0,"d":"0.0"}},{"$f":"IF(ISERROR(VLOOKUP($C$3,車速表!$A:$AE,14,FALSE))=TRUE,0,VLOOKUP($C$3,車速表!$A:$AE,14,FALSE))","v":{"v":0,"d":"0.0"}},{"$f":"IF(ISERROR(VLOOKUP($C$3,車速表!$A:$AE,15,FALSE))=TRUE,0,VLOOKUP($C$3,車速表!$A:$AE,15,FALSE))","v":{"v":0,"d":"0.0"}},{"$f":"IF(ISERROR(VLOOKUP($C$3,車速表!$A:$AE,16,FALSE))=TRUE,0,VLOOKUP($C$3,車速表!$A:$AE,16,FALSE))","v":{"v":0,"d":"0.0"}}]
[null,"中-2",{"v":0,"d":"0.0"},{"v":0,"d":"0.0"},{"v":0,"d":"0.0"},{"v":0,"d":"0.0"},{"$f":"IF(ISERROR(VLOOKUP($C$3,車速表!$A:$AE,17,FALSE))=TRUE,0,VLOOKUP($C$3,車速表!$A:$AE,17,FALSE))","v":{"v":0,"d":"0.0"}},{"$f":"IF(ISERROR(VLOOKUP($C$3,車速表!$A:$AE,18,FALSE))=TRUE,0,VLOOKUP($C$3,車速表!$A:$AE,18,FALSE))","v":{"v":0,"d":"0.0"}},{"$f":"IF(ISERROR(VLOOKUP($C$3,車速表!$A:$AE,19,FALSE))=TRUE,0,VLOOKUP($C$3,車速表!$A:$AE,19,FALSE))","v":{"v":0,"d":"0.0"}},{"$f":"IF(ISERROR(VLOOKUP($C$3,車速表!$A:$AE,20,FALSE))=TRUE,0,VLOOKUP($C$3,車速表!$A:$AE,20,FALSE))","v":{"v":0,"d":"0.0"}},{"$f":"IF(ISERROR(VLOOKUP($C$3,車速表!$A:$AE,21,FALSE))=TRUE,0,VLOOKUP($C$3,車速表!$A:$AE,21,FALSE))","v":{"v":0,"d":"0.0"}},{"$nulls":3},"中-2",{"v":0,"d":"0.0"},{"v":0,"d":"0.0"},{"v":0,"d":"0.0"},{"v":0,"d":"0.0"},{"$f":"IF(ISERROR(VLOOKUP($C$3,車速表!$A:$AE,17,FALSE))=TRUE,0,VLOOKUP($C$3,車速表!$A:$AE,17,FALSE))","v":{"v":0,"d":"0.0"}},{"$f":"IF(ISERROR(VLOOKUP($C$3,車速表!$A:$AE,18,FALSE))=TRUE,0,VLOOKUP($C$3,車速表!$A:$AE,18,FALSE))","v":{"v":0,"d":"0.0"}},{"$f":"IF(ISERROR(VLOOKUP($C$3,車速表!$A:$AE,19,FALSE))=TRUE,0,VLOOKUP($C$3,車速表!$A:$AE,19,FALSE))","v":{"v":0,"d":"0.0"}},{"$f":"IF(ISERROR(VLOOKUP($C$3,車速表!$A:$AE,20,FALSE))=TRUE,0,VLOOKUP($C$3,車速表!$A:$AE,20,FALSE))","v":{"v":0,"d":"0.0"}},{"$f":"IF(ISERROR(VLOOKUP($C$3,車速表!$A:$AE,21,FALSE))=TRUE,0,VLOOKUP($C$3,車速表!$A:$AE,21,FALSE))","v":{"v":0,"d":"0.0"}}]
[null,"低-3",{"v":0,"d":"0.0"},{"v":0,"d":"0.0"},{"v":0,"d":"0.0"},{"v":0,"d":"0.0"},{"$f":"IF(ISERROR(VLOOKUP($C$3,車速表!$A:$AE,22,FALSE))=TRUE,0,VLOOKUP($C$3,車速表!$A:$AE,22,FALSE))","v":{"v":0,"d":"0.0"}},{"$f":"IF(ISERROR(VLOOKUP($C$3,車速表!$A:$AE,23,FALSE))=TRUE,0,VLOOKUP($C$3,車速表!$A:$AE,23,FALSE))","v":{"v":0,"d":"0.0"}},{"$f":"IF(ISERROR(VLOOKUP($C$3,車速表!$A:$AE,24,FALSE))=TRUE,0,VLOOKUP($C$3,車速表!$A:$AE,24,FALSE))","v":{"v":0,"d":"0.0"}},{"$f":"IF(ISERROR(VLOOKUP($C$3,車速表!$A:$AE,25,FALSE))=TRUE,0,VLOOKUP($C$3,車速表!$A:$AE,25,FALSE))","v":{"v":0,"d":"0.0"}},{"$f":"IF(ISERROR(VLOOKUP($C$3,車速表!$A:$AE,26,FALSE))=TRUE,0,VLOOKUP($C$3,車速表!$A:$AE,26,FALSE))","v":{"v":0,"d":"0.0"}},null,null,"Travel speed","低-3",{"v":0,"d":"0.0"},{"v":0,"d":"0.0"},{"v":0,"d":"0.0"},{"v":0,"d":"0.0"},{"$f":"IF(ISERROR(VLOOKUP($C$3,車速表!$A:$AE,22,FALSE))=TRUE,0,VLOOKUP($C$3,車速表!$A:$AE,22,FALSE))","v":{"v":0,"d":"0.0"}},{"$f":"IF(ISERROR(VLOOKUP($C$3,車速表!$A:$AE,23,FALSE))=TRUE,0,VLOOKUP($C$3,車速表!$A:$AE,23,FALSE))","v":{"v":0,"d":"0.0"}},{"$f":"IF(ISERROR(VLOOKUP($C$3,車速表!$A:$AE,24,FALSE))=TRUE,0,VLOOKUP($C$3,車速表!$A:$AE,24,FALSE))","v":{"v":0,"d":"0.0"}},{"$f":"IF(ISERROR(VLOOKUP($C$3,車速表!$A:$AE,25,FALSE))=TRUE,0,VLOOKUP($C$3,車速表!$A:$AE,25,FALSE))","v":{"v":0,"d":"0.0"}},{"$f":"IF(ISERROR(VLOOKUP($C$3,車速表!$A:$AE,26,FALSE))=TRUE,0,VLOOKUP($C$3,車速表!$A:$AE,26,FALSE))","v":{"v":0,"d":"0.0"}}]
[null,"中-3",{"v":0,"d":"0.0"},{"v":0,"d":"0.0"},{"v":0,"d":"0.0"},{"v":0,"d":"0.0"},{"$f":"IF(ISERROR(VLOOKUP($C$3,車速表!$A:$AE,27,FALSE))=TRUE,0,VLOOKUP($C$3,車速表!$A:$AE,27,FALSE))","v":{"v":0,"d":"0.0"}},{"$f":"IF(ISERROR(VLOOKUP($C$3,車速表!$A:$AE,28,FALSE))=TRUE,0,VLOOKUP($C$3,車速表!$A:$AE,28,FALSE))","v":{"v":0,"d":"0.0"}},{"$f":"IF(ISERROR(VLOOKUP($C$3,車速表!$A:$AE,29,FALSE))=TRUE,0,VLOOKUP($C$3,車速表!$A:$AE,29,FALSE))","v":{"v":0,"d":"0.0"}},{"$f":"IF(ISERROR(VLOOKUP($C$3,車速表!$A:$AE,30,FALSE))=TRUE,0,VLOOKUP($C$3,車速表!$A:$AE,30,FALSE))","v":{"v":0,"d":"0.0"}},{"$f":"IF(ISERROR(VLOOKUP($C$3,車速表!$A:$AE,31,FALSE))=TRUE,0,VLOOKUP($C$3,車速表!$A:$AE,31,FALSE))","v":{"v":0,"d":"0.0"}},{"$nulls":3},"中-3",{"v":0,"d":"0.0"},{"v":0,"d":"0.0"},{"v":0,"d":"0.0"},{"v":0,"d":"0.0"},{"$f":"IF(ISERROR(VLOOKUP($C$3,車速表!$A:$AE,27,FALSE))=TRUE,0,VLOOKUP($C$3,車速表!$A:$AE,27,FALSE))","v":{"v":0,"d":"0.0"}},{"$f":"IF(ISERROR(VLOOKUP($C$3,車速表!$A:$AE,28,FALSE))=TRUE,0,VLOOKUP($C$3,車速表!$A:$AE,28,FALSE))","v":{"v":0,"d":"0.0"}},{"$f":"IF(ISERROR(VLOOKUP($C$3,車速表!$A:$AE,29,FALSE))=TRUE,0,VLOOKUP($C$3,車速表!$A:$AE,29,FALSE))","v":{"v":0,"d":"0.0"}},{"$f":"IF(ISERROR(VLOOKUP($C$3,車速表!$A:$AE,30,FALSE))=TRUE,0,VLOOKUP($C$3,車速表!$A:$AE,30,FALSE))","v":{"v":0,"d":"0.0"}},{"$f":"IF(ISERROR(VLOOKUP($C$3,車速表!$A:$AE,31,FALSE))=TRUE,0,VLOOKUP($C$3,車速表!$A:$AE,31,FALSE))","v":{"v":0,"d":"0.0"}}]
[]
[]
["作業条件①"]
[]
{"$rows_left_out":36}
{"sheet":"車速表","index":2,"n_rows":31,"n_cols":36,"rows_kept":31,"merged":[[0,1,0,5],[0,6,0,10],[0,11,0,15],[0,16,0,20],[0,21,0,25],[0,26,0,30],[0,34,0,35]]}
["定格エンジン回転数/車速","低－1",{"$nulls":4},"中－1",{"$nulls":4},"低－2",{"$nulls":4},"中－2",{"$nulls":4},"低－3",{"$nulls":4},"中－3",{"$nulls":5},"噴霧ポンプ","ノズル","使用時風量 (㎥）"]
["製　品　名",2400,2500,2600,2700,2800,2400,2500,2600,2700,2800,2400,2500,2600,2700,2800,2400,2500,2600,2700,2800,2400,2500,2600,2700,2800,2400,2500,2600,2700,2800,null,"最大吐出量","最大個数","H側","L側"]
["V512R(V512-Ⅱ)",{"$f":"C3*0.96","v":{"v":1.5360000228881836,"d":"1.5"}},{"v":1.600000023841858,"d":"1.6"},{"$f":"E3*0.96","v":{"v":0,"d":"0.0"}},{"$f":"F3*0.96","v":{"v":0,"d":"0.0"}},null,{"$f":"H3*0.96","v":{"v":0,"d":"0.0"}},{"v":0,"d":"0.0"},{"$f":"J3*0.96","v":{"v":0,"d":"0.0"}},{"$f":"K3*0.96","v":{"v":0,"d":"0.0"}},null,{"$f":"M3*0.96","v":{"v":2.1120000457763672,"d":"2.1"}},{"v":2.200000047683716,"d":"2.2"},{"$f":"O3*0.96","v":{"v":0,"d":"0.0"}},{"$f":"P3*0.96","v":{"v":0,"d":"0.0"}},null,{"$f":"R3*0.96","v":{"v":0,"d":"0.0"}},{"v":0,"d":"0.0"},{"$f":"T3*0.96","v":{"v":0,"d":"0.0"}},{"$f":"U3*0.96","v":{"v":0,"d":"0.0"}},null,{"$f":"W3*0.96","v":{"v":3.1679999542236326,"d":"3.2"}},{"v":3.299999952316284,"d":"3.3"},{"$f":"Y3*0.96","v":{"v":0,"d":"0.0"}},{"$f":"Z3*0.96","v":{"v":0,"d":"0.0"}},null,{"$f":"AB3*0.96","v":{"v":0,"d":"0.0"}},{"v":0,"d":"0.0"},{"$f":"AD3*0.96","v":{"v":0,"d":"0.0"}},{"$f":"AE3*0.96","v":{"v":0,"d":"0.0"}},null,null,{"v":66,"d":"66.0"},14,320,0]
["V522R(V522-Ⅱ)",{"$f":"C4*0.96","v":{"v":1.44,"d":"1.4"}},1.5,{"$f":"E4*0.96","v":{"v":0,"d":"0.0"}},{"$f":"F4*0.96","v":{"v":0,"d":"0.0"}},null,{"$f":"H4*0.96","v":{"v":0,"d":"0.0"}},{"v":0,"d":"0.0"},{"$f":"J4*0.96","v":{"v":0,"d":"0.0"}},{"$f":"K4*0.96","v":{"v":0,"d":"0.0"}},null,{"$f":"M4*0.96","v":{"v":2.0159999084472657,"d":"2.0"}},{"v":2.0999999046325684,"d":"2.1"},{"$f":"O4*0.96","v":{"v":0,"d":"0.0"}},{"$f":"P4*0.96","v":{"v":0,"d":"0.0"}},null,{"$f":"R4*0.96","v":{"v":0,"d":"0.0"}},{"v":0,"d":"0.0"},{"$f":"T4*0.96","v":{"v":0,"d":"0.0"}},{"$f":"U4*0.96","v":{"v":0,"d":"0.0"}},null,{"$f":"W4*0.96","v":{"v":2.9759999084472657,"d":"3.0"}},{"v":3.0999999046325684,"d":"3.1"},{"$f":"Y4*0.96","v":{"v":0,"d":"0.0"}},{"$f":"Z4*0.96","v":{"v":0,"d":"0.0"}},null,{"$f":"AB4*0.96","v":{"v":0,"d":"0.0"}},{"v":0,"d":"0.0"},{"$f":"AD4*0.96","v":{"v":0,"d":"0.0"}},{"$f":"AE4*0.96","v":{"v":0,"d":"0.0"}},null,null,{"v":85,"d":"85.0"},16,520,0]
["VE642R(VE642-Ⅱ)/CE643H(R)/FS643H(R)/VE642C/CE642HC/FS642HC",{"$f":"C5*0.96","v":{"v":1.2740198399999998,"d":"1.3"}},{"$f":"D5*0.96","v":{"v":1.3271039999999998,"d":"1.3"}},{"$f":"E5*0.96","v":{"v":1.3823999999999999,"d":"1.4"}},{"$f":"F5*0.96","v":{"v":1.44,"d":"1.4"}},1.5,{"$f":"H5*0.96","v":{"v":1.443889152,"d":"1.4"}},{"$f":"I5*0.96","v":{"v":1.5040512,"d":"1.5"}},{"$f":"J5*0.96","v":{"v":1.56672,"d":"1.6"}},{"$f":"K5*0.96","v":{"v":1.632,"d":"1.6"}},1.7,{"$f":"M5*0.96","v":{"v":1.7836277759999999,"d":"1.8"}},{"$f":"N5*0.96","v":{"v":1.8579455999999999,"d":"1.9"}},{"$f":"O5*0.96","v":{"v":1.93536,"d":"1.9"}},{"$f":"P5*0.96","v":{"v":2.016,"d":"2.0"}},2.1,{"$f":"R5*0.96","v":{"v":2.1233663999999997,"d":"2.1"}},{"$f":"S5*0.96","v":{"v":2.2118399999999996,"d":"2.2"}},{"$f":"T5*0.96","v":{"v":2.304,"d":"2.3"}},{"$f":"U5*0.96","v":2.4},2.5,{"$f":"W5*0.96","v":{"v":2.6329743359999997,"d":"2.6"}},{"$f":"X5*0.96","v":{"v":2.7426816,"d":"2.7"}},{"$f":"Y5*0.96","v":{"v":2.85696,"d":"2.9"}},{"$f":"Z5*0.96","v":{"v":2.976,"d":"3.0"}},3.1,{"$f":"AB5*0.96","v":{"v":3.0576476159999997,"d":"3.1"}},{"$f":"AC5*0.96","v":{"v":3.1850495999999997,"d":"3.2"}},{"$f":"AD5*0.96","v":{"v":3.31776,"d":"3.3"}},{"$f":"AE5*0.96","v":{"v":3.456,"d":"3.5"}},3.6,null,{"v":95,"d":"95.0"},18,727,517]
["VE1052R(VE1052-Ⅱ)/VE1052C",1.4,{"$nulls":4},1.7,{"$nulls":4},2.1,{"$nulls":4},2.5,{"$nulls":4},3.1,{"$nulls":4},3.6,{"$nulls":5},{"v":112,"d":"112.0"},20,795,527]
["CE1053H(R)/FSE1053H(R)/CE1052HC/FSE1052HC",1.5,{"$nulls":4},1.8,{"$nulls":4},2.2,{"$nulls":4},2.6,{"$nulls":4},3.2,{"$nulls":4},3.8,{"$nulls":5},{"v":112,"d":"112.0"},20,795,527]
["C1050HS/JA1051HC",{"$f":"C8*0.96","v":{"v":1.2902399999999998,"d":"1.3"}},{"$f":"D8*0.96","v":{"v":1.3439999999999999,"d":"1.3"}},1.4,{"$f":"F8*0.96","v":{"v":0,"d":"0.0"}},null,{"$f":"H8*0.96","v":{"v":1.4745599999999999,"d":"1.5"}},{"$f":"I8*0.96","v":{"v":1.536,"d":"1.5"}},1.6,{"$f":"K8*0.96","v":{"v":0,"d":"0.0"}},null,{"$f":"M8*0.96","v":{"v":1.8432,"d":"1.8"}},{"$f":"N8*0.96","v":{"v":1.92,"d":"1.9"}},{"v":2,"d":"2.0"},{"$f":"P8*0.96","v":{"v":0,"d":"0.0"}},null,{"$f":"R8*0.96","v":{"v":2.11968,"d":"2.1"}},{"$f":"S8*0.96","v":{"v":2.2079999999999997,"d":"2.2"}},2.3,{"$f":"U8*0.96","v":{"v":0,"d":"0.0"}},null,{"$f":"W8*0.96","v":{"v":2.7647999999999997,"d":"2.8"}},{"$f":"X8*0.96","v":{"v":2.88,"d":"2.9"}},{"v":3,"d":"3.0"},{"$f":"Z8*0.96","v":{"v":0,"d":"0.0"}},null,{"$f":"AB8*0.96","v":{"v":3.13344,"d":"3.1"}},{"$f":"AC8*0.96","v":{"v":3.264,"d":"3.3"}},3.4,{"$f":"AE8*0.96","v":{"v":0,"d":"0.0"}},null,null,{"v":116,"d":"116.0"},20,800,570]
["VE1050C/CE1051HC/FSE1051HC",{"$f":"C9*0.96","v":{"v":1.3823999999999999,"d":"1.4"}},{"$f":"D9*0.96","v":{"v":1.44,"d":"1.4"}},1.5,null,null,{"$f":"H9*0.96","v":{"v":1.56672,"d":"1.6"}},{"$f":"I9*0.96","v":{"v":1.632,"d":"1.6"}},1.7,null,null,{"$f":"M9*0.96","v":{"v":1.93536,"d":"1.9"}},{"$f":"N9*0.96","v":{"v":2.016,"d":"2.0"}},2.1,null,null,{"$f":"R9*0.96","v":{"v":2.304,"d":"2.3"}},{"$f":"S9*0.96","v":2.4},2.5,null,null,{"$f":"W9*0.96","v":{"v":2.85696,"d":"2.9"}},{"$f":"X9*0.96","v":{"v":2.976,"d":"3.0"}},3.1,null,null,{"$f":"AB9*0.96","v":{"v":3.40992,"d":"3.4"}},{"$f":"AC9*0.96","v":{"v":3.552,"d":"3.6"}},3.7,{"$nulls":3},{"v":116,"d":"116.0"},20,800,570]
["VT1050(C)/CT1050HC(HS)/CE(FST)1050HC/JA1050HC",{"v":1.3439999999999999,"d":"1.3"},1.4,{"v":0,"d":"0.0"},{"v":0,"d":"0.0"},null,{"v":1.632,"d":"1.6"},1.7,{"v":0,"d":"0.0"},{"v":0,"d":"0.0"},null,{"v":2.016,"d":"2.0"},2.1,{"v":0,"d":"0.0"},{"v":0,"d":"0.0"},null,{"v":2.304,"d":"2.3"},2.4,{"v":0,"d":"0.0"},{"v":0,"d":"0.0"},null,{"v":2.88,"d":"2.9"},{"v":3,"d":"3.0"},{"v":0,"d":"0.0"},{"v":0,"d":"0.0"},null,{"v":3.456,"d":"3.5"},3.6,{"v":0,"d":"0.0"},{"v":0,"d":"0.0"},null,null,{"v":112,"d":"112.0"},20,825,550]
["C523(R)/FS523P(R)/C522(PC)/C521/FS521(A)/FS522PC",{"v":1.44,"d":"1.4"},1.5,{"$f":"E11*0.96","v":{"v":0,"d":"0.0"}},{"v":0,"d":"0.0"},null,{"v":0,"d":"0.0"},null,{"$f":"J11*0.96","v":{"v":0,"d":"0.0"}},{"v":0,"d":"0.0"},null,{"v":2.016,"d":"2.0"},2.1,{"$f":"O11*0.96","v":{"v":0,"d":"0.0"}},{"v":0,"d":"0.0"},null,{"v":0,"d":"0.0"},{"v":0,"d":"0.0"},{"$f":"T11*0.96","v":{"v":0,"d":"0.0"}},{"v":0,"d":"0.0"},null,{"v":3.072,"d":"3.1"},3.2,{"$f":"Y11*0.96","v":{"v":0,"d":"0.0"}},{"v":0,"d":"0.0"},null,{"v":0,"d":"0.0"},{"v":0,"d":"0.0"},{"$f":"AD11*0.96","v":{"v":0,"d":"0.0"}},{"v":0,"d":"0.0"},null,null,{"v":63,"d":"63.0"},16,525]
["C522S/C518",{"v":1.44,"d":"1.4"},1.5,{"$f":"E12*0.96","v":{"v":0,"d":"0.0"}},{"$f":"F12*0.96","v":{"v":0,"d":"0.0"}},null,{"v":0,"d":"0.0"},null,{"$f":"J12*0.96","v":{"v":0,"d":"0.0"}},{"$f":"K12*0.96","v":{"v":0,"d":"0.0"}},null,{"v":2.016,"d":"2.0"},2.1,{"$f":"O12*0.96","v":{"v":0,"d":"0.0"}},{"$f":"P12*0.96","v":{"v":0,"d":"0.0"}},null,{"v":0,"d":"0.0"},{"v":0,"d":"0.0"},{"$f":"T12*0.96","v":{"v":0,"d":"0.0"}},{"$f":"U12*0.96","v":{"v":0,"d":"0.0"}},null,{"v":3.072,"d":"3.1"},3.2,{"$f":"Y12*0.96","v":{"v":0,"d":"0.0"}},{"$f":"Z12*0.96","v":{"v":0,"d":"0.0"}},null,{"v":0,"d":"0.0"},{"v":0,"d":"0.0"},{"$f":"AD12*0.96","v":{"v":0,"d":"0.0"}},{"$f":"AE12*0.96","v":{"v":0,"d":"0.0"}},null,null,{"v":47,"d":"47.0"},16,525]
["C522S/Y",{"$f":"C13*0.96","v":{"v":1.44,"d":"1.4"}},1.5,{"$f":"E13*0.96","v":{"v":0,"d":"0.0"}},{"$f":"F13*0.96","v":{"v":0,"d":"0.0"}},null,{"$f":"H13*0.96","v":{"v":0,"d":"0.0"}},null,{"$f":"J13*0.96","v":{"v":0,"d":"0.0"}},{"$f":"K13*0.96","v":{"v":0,"d":"0.0"}},null,{"$f":"M13*0.96","v":{"v":2.016,"d":"2.0"}},2.1,{"$f":"O13*0.96","v":{"v":0,"d":"0.0"}},{"$f":"P13*0.96","v":{"v":0,"d":"0.0"}},null,{"$f":"R13*0.96","v":{"v":0,"d":"0.0"}},{"v":0,"d":"0.0"},{"$f":"T13*0.96","v":{"v":0,"d":"0.0"}},{"$f":"U13*0.96","v":{"v":0,"d":"0.0"}},null,{"$f":"W13*0.96","v":{"v":3.072,"d":"3.1"}},3.2,{"$f":"Y13*0.96","v":{"v":0,"d":"0.0"}},{"$f":"Z13*0.96","v":{"v":0,"d":"0.0"}},null,{"$f":"AB13*0.96","v":{"v":0,"d":"0.0"}},{"v":0,"d":"0.0"},{"$f":"AD13*0.96","v":{"v":0,"d":"0.0"}},{"$f":"AE13*0.96","v":{"v":0,"d":"0.0"}},null,null,{"v":63,"d":"63.0"},16,525]
["C622PC",{"v":1.536,"d":"1.5"},1.6,{"v":0,"d":"0.0"},{"v":0,"d":"0.0"},null,{"v":0,"d":"0.0"},{"$f":"I14*0.96","v":{"v":0,"d":"0.0"}},{"v":0,"d":"0.0"},{"v":0,"d":"0.0"},null,{"v":2.112,"d":"2.1"},2.2,{"v":0,"d":"0.0"},{"v":0,"d":"0.0"},null,{"v":0,"d":"0.0"},{"v":0,"d":"0.0"},{"v":0,"d":"0.0"},{"v":0,"d":"0.0"},null,{"v":3.264,"d":"3.3"},3.4,{"v":0,"d":"0.0"},{"v":0,"d":"0.0"},null,{"v":0,"d":"0.0"},{"v":0,"d":"0.0"},{"v":0,"d":"0.0"},{"v":0,"d":"0.0"},null,null,{"v":93,"d":"93.0"},16,525]
["C525P(R)/C625P(R)/C524P/C624P",{"$f":"C15*0.96","v":{"v":1.536,"d":"1.5"}},1.6,{"$f":"E15*0.96","v":{"v":0,"d":"0.0"}},{"$f":"F15*0.96","v":{"v":0,"d":"0.0"}},null,{"$f":"H15*0.96","v":{"v":0,"d":"0.0"}},{"$f":"I15*0.96","v":{"v":0,"d":"0.0"}},{"$f":"J15*0.96","v":{"v":0,"d":"0.0"}},{"$f":"K15*0.96","v":{"v":0,"d":"0.0"}},null,{"$f":"M15*0.96","v":{"v":2.112,"d":"2.1"}},2.2,{"$f":"O15*0.96","v":{"v":0,"d":"0.0"}},{"$f":"P15*0.96","v":{"v":0,"d":"0.0"}},null,{"$f":"R15*0.96","v":{"v":0,"d":"0.0"}},{"v":0,"d":"0.0"},{"$f":"T15*0.96","v":{"v":0,"d":"0.0"}},{"$f":"U15*0.96","v":{"v":0,"d":"0.0"}},null,{"$f":"W15*0.96","v":{"v":3.264,"d":"3.3"}},3.4,{"$f":"Y15*0.96","v":{"v":0,"d":"0.0"}},null,null,{"$f":"AB15*0.96","v":{"v":0,"d":"0.0"}},{"v":0,"d":"0.0"},{"$f":"AD15*0.96","v":{"v":0,"d":"0.0"}},{"$f":"AE15*0.96","v":{"v":0,"d":"0.0"}},null,null,{"v":93,"d":"93.0"},16,560]
{"$rows_left_out":17}
{"sheet":"吐出量表","index":3,"n_rows":21,"n_cols":10,"rows_kept":21,"hidden":true}
[null,"1.0MPa","1.5MPa","2.0MPa",null,"散布幅","走行距離（ｍ）"]
["Φ0.8","0.98","1.21",{"v":1.4,"d":"1.40"},null,"3m",333]
["Φ1.0","1.29",1.59,1.83,null,"3.5m",285]
["Φ1.2","1.72","2.10",2.37,null,"4m",250,null,"横(m)","=散布幅×２"]
["Φ1.2(3H)","2.58",3.17,3.64,null,"4.5m",222,null,"縦(m)","=10a÷横幅(m)"]
["Φ1.5","2.35",2.85,{"v":3.3,"d":"3.30"},null,"5m",200,null,"走行距離","=縦×１（両側散布）+縦×２×1/2（片側散布）=縦×２往復"]
["Φ1.5(3H)","4.23","4.89",5.31,null,"5.6m",177,null,null,"=1000㎡÷（散布幅×2列）×2往復"]
["Φ1.8","2.80","3.50",4.06,null,"6m",167,null,null,"=1000÷散布幅"]
["Φ1.8(3H)","5.04",6.01,6.81,null,"6.5m",154]
["黄","1.01",1.22,{"v":1.4,"d":"1.40"},null,"7m",143]
["オレンジ","1.34",1.62,1.85,null,"7.5m",133]
["赤","1.94",2.37,2.74,null,"8m",125]
["緑","2.42",2.97,3.41]
["SV-23-40K","1.9","2.3"]
["SV-30-55K","2.5","3.0"]
{"$rows_left_out":7}
{"sheet":"追加登録","index":4,"n_rows":25,"n_cols":6,"rows_kept":25,"hidden":true,"merged":[[3,3,3,6]]}
[null,"追加する製品データを入力後、「製品データ追加」ボタンをクリックしてください。"]
[]
[]
[null,"製品名",null,"C523/FS523P"]
[null,"エンジン定格回転数",null,2500,"rpm","←リストから選択（それ以外の回転数は対応不可）。"]
[null,"定格回転時車速","低-1",1.5,"km/h"]
[null,null,"中-1",0,"km/h","←副変速に「中」がない機種は、中-1～3は0にする。"]
[null,null,"低-2",2.1,"km/h"]
[null,null,"中-2",0,"km/h"]
[null,null,"低-3",3.2,"km/h"]
[null,null,"中-3",0,"km/h"]
[null,"噴霧ポンプ吐出量",null,63,"L/分","←カタログ値（余水考慮前）を入力する。"]
[null,"使用時風量","H側",525,"㎥/分","←風量切り替えがない機種はH側に入力する。"]
[null,null,"L側",null,"㎥/分"]
[null,"ノズル個数",null,16,"個"]
{"$rows_left_out":2}