{"text_format":"3","workbook":"xlsx","n_sheets":5,"sheets":["■散布量計算シート","作業シート","車速表","吐出量表","追加登録"],"not_rendered":{"images":2,"macros":1,"defined_names":7,"comments":2},"read":"whole","date_system":"1900"}

{"sheet":"■散布量計算シート","index":0,"n_rows":62,"n_cols":12,"rows_kept":62,"merged":[[0,1,0,9],[1,5,1,7],[2,4,2,8],[4,3,4,4],[4,6,4,8],[6,3,6,11],[8,1,8,2],[8,3,8,5],[8,8,8,9],[10,1,10,10],[11,1,11,2],[13,1,13,2],[13,3,13,4],[15,1,15,2],[15,3,15,4],[15,11,16,11],[17,1,17,2],[19,3,19,11],[20,1,20,2],[21,1,26,1],[28,1,28,2],[29,1,29,2],[33,1,33,11],[34,1,34,2],[36,1,36,2],[36,3,36,4],[38,1,38,2],[38,3,38,4],[38,11,39,11],[40,1,40,2],[42,3,42,11],[43,1,43,2],[44,1,49,1],[51,1,51,2],[52,1,52,2],[55,1,55,11],[57,1,57,3],[57,6,57,11],[58,1,58,3],[58,6,58,11],[59,1,61,5],[59,6,59,11],[60,6,60,11],[61,6,61,11],[62,1,62,11]]}
[]
[{"$nulls":5},"散布量計算"]
[{"$nulls":4},"＜＜　昭信式ノズル　＞＞"]
[]
[null,"お客様","おところ",null,null,"お名前",{"$nulls":3},"様"]
[]
[null,"製品名","3S-","FST1063H"]
[]
[null,"計算担当者",{"$nulls":6},{"$f":"NOW()","v":"2020-05-27T13:58:06.140"},null,"作成"]
[]
[]
[null,"■散布条件-１"]
[]
[null,"栽培品目/圃場名",null,"リンゴ",null,null,"噴霧方向","噴板名称","ノズル個数","吐出量"]
[{"$nulls":6},"上・斜め上","Φ 1.5",18,{"$f":"作業シート!G17","v":{"v":67.86,"d":"67.9"}},{"$f":"IF($J$18>0,J15/$J$18,0)","v":{"v":0.6283333333333333,"d":"63%"}}]
{"$rows_left_out":48}
{"sheet":"作業シート","index":1,"n_rows":50,"n_cols":23,"rows_kept":50,"hidden":true,"merged":[[2,2,2,10],[2,14,2,22],[4,0,4,1],[4,12,4,13],[5,0,10,0],[5,12,8,12],[9,12,10,12],[12,0,12,10],[13,0,13,4],[16,0,16,1],[17,0,17,1],[18,0,18,1],[19,12,19,13],[19,14,19,17],[19,19,19,20],[21,0,21,1],[21,12,21,13],[22,0,27,0],[22,12,25,12],[26,12,27,12],[28,0,28,1],[31,0,31,9],[32,0,32,4],[35,0,35,1],[36,0,36,1],[37,0,37,1],[38,12,38,13],[38,14,38,17],[38,19,38,20],[40,0,40,1],[40,12,40,13],[41,0,46,0],[41,12,44,12],[45,12,46,12],[47,0,47,1]]}
[]
[]
["製 品 名","3S-",{"$f":"■散布量計算シート!D7","v":"FST1063H"},{"$nulls":9},"製品名","3S-",{"$f":"■散布量計算シート!D7","v":"FST1063H"}]
[]
["エンジン回転数(rpm)",null,1600,1800,2000,2200,2400,2500,2600,2700,2800,null,"エンジン回転数(rpm)",null,1600,1800,2000,2200,2400,2500,2600,2700,2800]
["車速","低-1",{"$f":"G6*0.64","v":{"v":0.96,"d":"1.0"}},{"$f":"G6*0.72","v":{"v":1.08,"d":"1.1"}},{"$f":"G6*0.8","v":{"v":1.2000000000000002,"d":"1.2"}},{"$f":"G6*0.88","v":{"v":1.32,"d":"1.3"}},{"$f":"IF(ISERROR(VLOOKUP($C$3,車速表!$A:$AE,2,FALSE))=TRUE,0,VLOOKUP($C$3,車速表!$A:$AE,2,FALSE))","v":1.5},{"$f":"IF(ISERROR(VLOOKUP($C$3,車速表!$A:$AE,3,FALSE))=TRUE,0,VLOOKUP($C$3,車速表!$A:$AE,3,FALSE))","v":{"v":0,"d":"0.0"}},{"$f":"IF(ISERROR(VLOOKUP($C$3,車速表!$A:$AE,4,FALSE))=TRUE,0,VLOOKUP($C$3,車速表!$A:$AE,4,FALSE))","v":{"v":0,"d":"0.0"}},{"$f":"IF(ISERROR(VLOOKUP($C$3,車速表!$A:$AE,5,FALSE))=TRUE,0,VLOOKUP($C$3,車速表!$A:$AE,5,FALSE))","v":{"v":0,"d":"0.0"}},{"$f":"IF(ISERROR(VLOOKUP($C$3,車速表!$A:$AE,6,FALSE))=TRUE,0,VLOOKUP($C$3,車速表!$A:$AE,6,FALSE))","v":{"v":0,"d":"0.0"}},null,"車速\n(km/h)","低-1",{"$f":"S6*0.64","v":{"v":0.96,"d":"1.0"}},{"$f":"S6*0.72","v":{"v":1.08,"d":"1.1"}},{"$f":"S6*0.8","v":{"v":1.2000000000000002,"d":"1.2"}},{"$f":"S6*0.88","v":{"v":1.32,"d":"1.3"}},{"$f":"IF(ISERROR(VLOOKUP($C$3,車速表!$A:$AE,2,FALSE))=TRUE,0,VLOOKUP($C$3,車速表!$A:$AE,2,FALSE))","v":1.5},{"$f":"IF(ISERROR(VLOOKUP($C$3,車速表!$A:$AE,3,FALSE))=TRUE,0,VLOOKUP($C$3,車速表!$A:$AE,3,FALSE))","v":{"v":0,"d":"0.0"}},{"$f":"IF(ISERROR(VLOOKUP($C$3,車速表!$A:$AE,4,FALSE))=TRUE,0,VLOOKUP($C$3,車速表!$A:$AE,4,FALSE))","v":{"v":0,"d":"0.0"}},{"$f":"IF(ISERROR(VLOOKUP($C$3,車速表!$A:$AE,5,FALSE))=TRUE,0,VLOOKUP($C$3,車速表!$A:$AE,5,FALSE))","v":{"v":0,"d":"0.0"}},{"$f":"IF(ISERROR(VLOOKUP($C$3,車速表!$A:$AE,6,FALSE))=TRUE,0,VLOOKUP($C$3,車速表!$A:$AE,6,FALSE))","v":{"v":0,"d":"0.0"}}]
[null,"中-1",{"v":1.151999969482422,"d":"1.2"},{"v":1.2959999656677246,"d":"1.3"},{"v":1.4399999618530275,"d":"1.4"},{"v":1.5839999580383302,"d":"1.6"},{"$f":"IF(ISERROR(VLOOKUP($C$3,車速表!$A:$AE,7,FALSE))=TRUE,0,VLOOKUP($C$3,車速表!$A:$AE,7,FALSE))","v":{"v":1.7999999523162842,"d":"1.8"}},{"$f":"IF(ISERROR(VLOOKUP($C$3,車速表!$A:$AE,8,FALSE))=TRUE,0,VLOOKUP($C$3,車速表!$A:$AE,8,FALSE))","v":{"v":0,"d":"0.0"}},{"$f":"IF(ISERROR(VLOOKUP($C$3,車速表!$A:$AE,9,FALSE))=TRUE,0,VLOOKUP($C$3,車速表!$A:$AE,9,FALSE))","v":{"v":0,"d":"0.0"}},{"$f":"IF(ISERROR(VLOOKUP($C$3,車速表!$A:$AE,10,FALSE))=TRUE,0,VLOOKUP($C$3,車速表!$A:$AE,10,FALSE))","v":{"v":0,"d":"0.0"}},{"$f":"IF(ISERROR(VLOOKUP($C$3,車速表!$A:$AE,11,FALSE))=TRUE,0,VLOOKUP($C$3,車速表!$A:$AE,11,FALSE))","v":{"v":0,"d":"0.0"}},null,null,"中-1",{"v":1.151999969482422,"d":"1.2"},{"v":1.2959999656677246,"d":"1.3"},{"v":1.4399999618530275,"d":"1.4"},{"v":1.5839999580383302,"d":"1.6"},{"$f":"IF(ISERROR(VLOOKUP($C$3,車速表!$A:$AE,7,FALSE))=TRUE,0,VLOOKUP($C$3,車速表!$A:$AE,7,FALSE))","v":{"v":1.7999999523162842,"d":"1.8"}},{"$f":"IF(ISERROR(VLOOKUP($C$3,車速表!$A:$AE,8,FALSE))=TRUE,0,VLOOKUP($C$3,車速表!$A:$AE,8,FALSE))","v":{"v":0,"d":"0.0"}},{"$f":"IF(ISERROR(VLOOKUP($C$3,車速表!$A:$AE,9,FALSE))=TRUE,0,VLOOKUP($C$3,車速表!$A:$AE,9,FALSE))","v":{"v":0,"d":"0.0"}},{"$f":"IF(ISERROR(VLOOKUP($C$3,車速表!$A:$AE,10,FALSE))=TRUE,0,VLOOKUP($C$3,車速表!$A:$AE,10,FALSE))","v":{"v":0,"d":"0.0"}},{"$f":"IF(ISERROR(VLOOKUP($C$3,車速表!$A:$AE,11,FALSE))=TRUE,0,VLOOKUP($C$3,車速表!$A:$AE,11,FALSE))","v":{"v":0,"d":"0.0"}}]
[null,"低-2",{"v":1.4080000305175782,"d":"1.4"},{"v":1.5840000343322753,"d":"1.6"},{"v":1.7600000381469727,"d":"1.8"},{"v":1.9360000419616699,"d":"1.9"},{"$f":"IF(ISERROR(VLOOKUP($C$3,車速表!$A:$AE,12,FALSE))=TRUE,0,VLOOKUP($C$3,車速表!$A:$AE,12,FALSE))","v":{"v":2.200000047683716,"d":"2.2"}},{"$f":"IF(ISERROR(VLOOKUP($C$3,車速表!$A:$AE,13,FALSE))=TRUE,0,VLOOKUP($C$3,車速表!$A:$AE,13,FALSE))","v":{"v":0,"d":"0.0"}},{"$f":"IF(ISERROR(VLOOKUP($C$3,車速表!$A:$AE,14,FALSE))=TRUE,0,VLOOKUP($C$3,車速表!$A:$AE,14,FALSE))","v":{"v":0,"d":"0.0"}},{"$f":"IF(ISERROR(VLOOKUP($C$3,車速表!$A:$AE,15,FALSE))=TRUE,0,VLOOKUP($C$3,車速表!$A:$AE,15,FALSE))","v":{"v":0,"d":"0.0"}},{"$f":"IF(ISERROR(VLOOKUP($C$3,車速表!$A:$AE,16,FALSE))=TRUE,0,VLOOKUP($C$3,車速表!$A:$AE,16,FALSE))","v":{"v":0,"d":"0.0"}},null,null,"低-2",{"v":1.4080000305175782,"d":"1.4"},{"v":1.5840000343322753,"d":"1.6"},{"v":1.7600000381469727,"d":"1.8"},{"v":1.9360000419616699,"d":"1.9"},{"$f":"IF(ISERROR(VLOOKUP($C$3,車速表!$A:$AE,12,FALSE))=TRUE,0,VLOOKUP($C$3,車速表!$A:$AE,12,FALSE))","v":{"v":2.200000047683716,"d":"2.2"}},{"$f":"IF(ISERROR(VLOOKUP($C$3,車速表!$A:$AE,13,FALSE))=TRUE,0,VLOOKUP($C$3,車速表!$A:$AE,13,FALSE))","v":{"v":0,"d":"0.0"}},{"$f":"IF(ISERROR(VLOOKUP($C$3,車速表!$A:$AE,14,FALSE))=TRUE,0,VLOOKUP($C$3,車速表!$A:$AE,14,FALSE))","v":{"v":0,"d":"0.0"}},{"$f":"IF(ISERROR(VLOOKUP($C$3,車速表!$A:$AE,15,FALSE))=TRUE,0,VLOOKUP($C$3,車速表!$A:$AE,15,FALSE))","v":{"v":0,"d":"0.0"}},{"$f":"IF(ISERROR(VLOOKUP($C$3,車速表!$A:$AE,16,FALSE))=TRUE,0,VLOOKUP($C$3,車速表!$A:$AE,16,FALSE))","v":{"v":0,"d":"0.0"}}]
[null,"中-2",{"v":1.6639999389648439,"d":"1.7"},{"v":1.8719999313354492,"d":"1.9"},{"v":2.0799999237060547,"d":"2.1"},{"v":2.28799991607666,"d":"2.3"},{"$f":"IF(ISERROR(VLOOKUP($C$3,車速表!$A:$AE,17,FALSE))=TRUE,0,VLOOKUP($C$3,車速表!$A:$AE,17,FALSE))","v":{"v":2.5999999046325684,"d":"2.6"}},{"$f":"IF(ISERROR(VLOOKUP($C$3,車速表!$A:$AE,18,FALSE))=TRUE,0,VLOOKUP($C$3,車速表!$A:$AE,18,FALSE))","v":{"v":0,"d":"0.0"}},{"$f":"IF(ISERROR(VLOOKUP($C$3,車速表!$A:$AE,19,FALSE))=TRUE,0,VLOOKUP($C$3,車速表!$A:$AE,19,FALSE))","v":{"v":0,"d":"0.0"}},{"$f":"IF(ISERROR(VLOOKUP($C$3,車速表!$A:$AE,20,FALSE))=TRUE,0,VLOOKUP($C$3,車速表!$A:$AE,20,FALSE))","v":{"v":0,"d":"0.0"}},{"$f":"IF(ISERROR(VLOOKUP($C$3,車速表!$A:$AE,21,FALSE))=TRUE,0,VLOOKUP($C$3,車速表!$A:$AE,21,FALSE))","v":{"v":0,"d":"0.0"}},null,null,"中-2",{"v":1.6639999389648439,"d":"1.7"},{"v":1.8719999313354492,"d":"1.9"},{"v":2.0799999237060547,"d":"2.1"},{"v":2.28799991607666,"d":"2.3"},{"$f":"IF(ISERROR(VLOOKUP($C$3,車速表!$A:$AE,17,FALSE))=TRUE,0,VLOOKUP($C$3,車速表!$A:$AE,17,FALSE))","v":{"v":2.5999999046325684,"d":"2.6"}},{"$f":"IF(ISERROR(VLOOKUP($C$3,車速表!$A:$AE,18,FALSE))=TRUE,0,VLOOKUP($C$3,車速表!$A:$AE,18,FALSE))","v":{"v":0,"d":"0.0"}},{"$f":"IF(ISERROR(VLOOKUP($C$3,車速表!$A:$AE,19,FALSE))=TRUE,0,VLOOKUP($C$3,車速表!$A:$AE,19,FALSE))","v":{"v":0,"d":"0.0"}},{"$f":"IF(ISERROR(VLOOKUP($C$3,車速表!$A:$AE,20,FALSE))=TRUE,0,VLOOKUP($C$3,車速表!$A:$AE,20,FALSE))","v":{"v":0,"d":"0.0"}},{"$f":"IF(ISERROR(VLOOKUP($C$3,車速表!$A:$AE,21,FALSE))=TRUE,0,VLOOKUP($C$3,車速表!$A:$AE,21,FALSE))","v":{"v":0,"d":"0.0"}}]
[null,"低-3",{"v":2.0480000305175783,"d":"2.0"},{"v":2.3040000343322755,"d":"2.3"},{"v":2.5600000381469727,"d":"2.6"},{"v":2.81600004196167,"d":"2.8"},{"$f":"IF(ISERROR(VLOOKUP($C$3,車速表!$A:$AE,22,FALSE))=TRUE,0,VLOOKUP($C$3,車速表!$A:$AE,22,FALSE))","v":{"v":3.200000047683716,"d":"3.2"}},{"$f":"IF(ISERROR(VLOOKUP($C$3,車速表!$A:$AE,23,FALSE))=TRUE,0,VLOOKUP($C$3,車速表!$A:$AE,23,FALSE))","v":{"v":0,"d":"0.0"}},{"$f":"IF(ISERROR(VLOOKUP($C$3,車速表!$A:$AE,24,FALSE))=TRUE,0,VLOOKUP($C$3,車速表!$A:$AE,24,FALSE))","v":{"v":0,"d":"0.0"}},{"$f":"IF(ISERROR(VLOOKUP($C$3,車速表!$A:$AE,25,FALSE))=TRUE,0,VLOOKUP($C$3,車速表!$A:$AE,25,FALSE))","v":{"v":0,"d":"0.0"}},{"$f":"IF(ISERROR(VLOOKUP($C$3,車速表!$A:$AE,26,FALSE))=TRUE,0,VLOOKUP($C$3,車速表!$A:$AE,26,FALSE))","v":{"v":0,"d":"0.0"}},null,"Travel speed","低-3",{"v":2.0480000305175783,"d":"2.0"},{"v":2.3040000343322755,"d":"2.3"},{"v":2.5600000381469727,"d":"2.6"},{"v":2.81600004196167,"d":"2.8"},{"$f":"IF(ISERROR(VLOOKUP($C$3,車速表!$A:$AE,22,FALSE))=TRUE,0,VLOOKUP($C$3,車速表!$A:$AE,22,FALSE))","v":{"v":3.200000047683716,"d":"3.2"}},{"$f":"IF(ISERROR(VLOOKUP($C$3,車速表!$A:$AE,23,FALSE))=TRUE,0,VLOOKUP($C$3,車速表!$A:$AE,23,FALSE))","v":{"v":0,"d":"0.0"}},{"$f":"IF(ISERROR(VLOOKUP($C$3,車速表!$A:$AE,24,FALSE))=TRUE,0,VLOOKUP($C$3,車速表!$A:$AE,24,FALSE))","v":{"v":0,"d":"0.0"}},{"$f":"IF(ISERROR(VLOOKUP($C$3,車速表!$A:$AE,25,FALSE))=TRUE,0,VLOOKUP($C$3,車速表!$A:$AE,25,FALSE))","v":{"v":0,"d":"0.0"}},{"$f":"IF(ISERROR(VLOOKUP($C$3,車速表!$A:$AE,26,FALSE))=TRUE,0,VLOOKUP($C$3,車速表!$A:$AE,26,FALSE))","v":{"v":0,"d":"0.0"}}]
[null,"中-3",{"v":2.431999969482422,"d":"2.4"},{"v":2.7359999656677245,"d":"2.7"},{"v":3.0399999618530273,"d":"3.0"},{"v":3.34399995803833,"d":"3.3"},{"$f":"IF(ISERROR(VLOOKUP($C$3,車速表!$A:$AE,27,FALSE))=TRUE,0,VLOOKUP($C$3,車速表!$A:$AE,27,FALSE))","v":{"v":3.799999952316284,"d":"3.8"}},{"$f":"IF(ISERROR(VLOOKUP($C$3,車速表!$A:$AE,28,FALSE))=TRUE,0,VLOOKUP($C$3,車速表!$A:$AE,28,FALSE))","v":{"v":0,"d":"0.0"}},{"$f":"IF(ISERROR(VLOOKUP($C$3,車速表!$A:$AE,29,FALSE))=TRUE,0,VLOOKUP($C$3,車速表!$A:$AE,29,FALSE))","v":{"v":0,"d":"0.0"}},{"$f":"IF(ISERROR(VLOOKUP($C$3,車速表!$A:$AE,30,FALSE))=TRUE,0,VLOOKUP($C$3,車速表!$A:$AE,30,FALSE))","v":{"v":0,"d":"0.0"}},{"$f":"IF(ISERROR(VLOOKUP($C$3,車速表!$A:$AE,31,FALSE))=TRUE,0,VLOOKUP($C$3,車速表!$A:$AE,31,FALSE))","v":{"v":0,"d":"0.0"}},null,null,"中-3",{"v":2.431999969482422,"d":"2.4"},{"v":2.7359999656677245,"d":"2.7"},{"v":3.0399999618530273,"d":"3.0"},{"v":3.34399995803833,"d":"3.3"},{"$f":"IF(ISERROR(VLOOKUP($C$3,車速表!$A:$AE,27,FALSE))=TRUE,0,VLOOKUP($C$3,車速表!$A:$AE,27,FALSE))","v":{"v":3.799999952316284,"d":"3.8"}},{"$f":"IF(ISERROR(VLOOKUP($C$3,車速表!$A:$AE,28,FALSE))=TRUE,0,VLOOKUP($C$3,車速表!$A:$AE,28,FALSE))","v":{"v":0,"d":"0.0"}},{"$f":"IF(ISERROR(VLOOKUP($C$3,車速表!$A:$AE,29,FALSE))=TRUE,0,VLOOKUP($C$3,車速表!$A:$AE,29,FALSE))","v":{"v":0,"d":"0.0"}},{"$f":"IF(ISERROR(VLOOKUP($C$3,車速表!$A:$AE,30,FALSE))=TRUE,0,VLOOKUP($C$3,車速表!$A:$AE,30,FALSE))","v":{"v":0,"d":"0.0"}},{"$f":"IF(ISERROR(VLOOKUP($C$3,車速表!$A:$AE,31,FALSE))=TRUE,0,VLOOKUP($C$3,車速表!$A:$AE,31,FALSE))","v":{"v":0,"d":"0.0"}}]
[]
[]
["作業条件①"]
[]
{"$rows_left_out":36}
{"sheet":"車速表","index":2,"n_rows":51,"n_cols":36,"rows_kept":51,"hidden":true,"merged":[[0,1,0,5],[0,6,0,10],[0,11,0,15],[0,16,0,20],[0,21,0,25],[0,26,0,30],[0,34,0,35]]}
["定格エンジン回転数/車速","低－1",{"$nulls":4},"中－1",{"$nulls":4},"低－2",{"$nulls":4},"中－2",{"$nulls":4},"低－3",{"$nulls":4},"中－3",{"$nulls":5},"噴霧ポンプ","ノズル","使用時風量 (㎥）"]
["製　品　名",2400,2500,2600,2700,2800,2400,2500,2600,2700,2800,2400,2500,2600,2700,2800,2400,2500,2600,2700,2800,2400,2500,2600,2700,2800,2400,2500,2600,2700,2800,null,"最大吐出量","最大個数","H側","L側"]
["CT1050H",{"$f":"C3*0.96","v":{"v":1.3439999771118163,"d":"1.3"}},{"v":1.399999976158142,"d":"1.4"},{"$f":"E3*0.96","v":{"v":0,"d":"0.0"}},{"$f":"F3*0.96","v":{"v":0,"d":"0.0"}},null,{"$f":"H3*0.96","v":{"v":1.632000045776367,"d":"1.6"}},{"v":1.7000000476837158,"d":"1.7"},{"$f":"J3*0.96","v":{"v":0,"d":"0.0"}},{"$f":"K3*0.96","v":{"v":0,"d":"0.0"}},null,{"$f":"M3*0.96","v":{"v":2.0159999084472657,"d":"2.0"}},{"v":2.0999999046325684,"d":"2.1"},{"$f":"O3*0.96","v":{"v":0,"d":"0.0"}},{"$f":"P3*0.96","v":{"v":0,"d":"0.0"}},null,{"$f":"R3*0.96","v":{"v":2.304000091552734,"d":"2.3"}},{"v":2.4000000953674316,"d":"2.4"},{"$f":"T3*0.96","v":{"v":0,"d":"0.0"}},{"$f":"U3*0.96","v":{"v":0,"d":"0.0"}},null,{"$f":"W3*0.96","v":{"v":2.88,"d":"2.9"}},{"v":3,"d":"3.0"},{"$f":"Y3*0.96","v":{"v":0,"d":"0.0"}},{"$f":"Z3*0.96","v":{"v":0,"d":"0.0"}},null,{"$f":"AB3*0.96","v":{"v":3.4559999084472657,"d":"3.5"}},{"v":3.5999999046325684,"d":"3.6"},{"$f":"AD3*0.96","v":{"v":0,"d":"0.0"}},{"$f":"AE3*0.96","v":{"v":0,"d":"0.0"}},null,null,112,28,825,550]
["FST1063H",1.5,{"$f":"D4*0.96","v":{"v":0,"d":"0.0"}},{"$f":"E4*0.96","v":{"v":0,"d":"0.0"}},{"$f":"F4*0.96","v":{"v":0,"d":"0.0"}},null,{"v":1.7999999523162842,"d":"1.8"},{"$f":"I4*0.96","v":{"v":0,"d":"0.0"}},{"$f":"J4*0.96","v":{"v":0,"d":"0.0"}},{"$f":"K4*0.96","v":{"v":0,"d":"0.0"}},null,{"v":2.200000047683716,"d":"2.2"},{"$f":"N4*0.96","v":{"v":0,"d":"0.0"}},{"$f":"O4*0.96","v":{"v":0,"d":"0.0"}},{"$f":"P4*0.96","v":{"v":0,"d":"0.0"}},null,{"v":2.5999999046325684,"d":"2.6"},{"$f":"S4*0.96","v":{"v":0,"d":"0.0"}},{"$f":"T4*0.96","v":{"v":0,"d":"0.0"}},{"$f":"U4*0.96","v":{"v":0,"d":"0.0"}},null,{"v":3.200000047683716,"d":"3.2"},{"$f":"X4*0.96","v":{"v":0,"d":"0.0"}},{"$f":"Y4*0.96","v":{"v":0,"d":"0.0"}},{"$f":"Z4*0.96","v":{"v":0,"d":"0.0"}},null,{"v":3.799999952316284,"d":"3.8"},{"$f":"AC4*0.96","v":{"v":0,"d":"0.0"}},{"$f":"AD4*0.96","v":{"v":0,"d":"0.0"}},{"$f":"AE4*0.96","v":{"v":0,"d":"0.0"}},null,null,154,36,880,593]
["V512",{"$f":"C5*0.96","v":{"v":1.5264,"d":"1.5"}},{"v":1.59,"d":"1.6"},{"$nulls":3},{"$f":"H5*0.96","v":{"v":0,"d":"0.0"}},{"$nulls":4},{"$f":"M5*0.96","v":{"v":2.1312,"d":"2.1"}},{"v":2.22,"d":"2.2"},{"$nulls":3},{"$f":"R5*0.96","v":{"v":0,"d":"0.0"}},{"$nulls":4},{"$f":"W5*0.96","v":{"v":3.1679999999999997,"d":"3.2"}},3.3,{"$nulls":3},{"$f":"AB5*0.96","v":{"v":0,"d":"0.0"}},{"$nulls":5},51.2,14,320]
["FSC1062(L)",{"$f":"C6*0.96","v":{"v":1.3439999999999999,"d":"1.3"}},1.4,1.5,1.6,null,2.4,2.5,2.7,2.8,null,{"v":1.632,"d":"1.6"},1.7,1.8,1.9,null,{"v":2.88,"d":"2.9"},{"v":3,"d":"3.0"},3.3,3.4,null,{"v":2.112,"d":"2.1"},2.2,2.3,2.4,null,{"v":3.7439999999999998,"d":"3.7"},3.9,4.2,4.4,null,null,{"v":155,"d":"155.0"},36,936]
["VE1052/CE1052H/FSE1052H(青森仕様ノズル）",1.5,{"$nulls":4},1.8,{"$nulls":4},2.2,{"$nulls":4},2.6,{"$nulls":4},3.2,{"$nulls":4},3.8,{"$nulls":5},{"v":112,"d":"112.0"},28,795,527]
["VE1050C/CE1051HC/FSE1051HC(青森仕様ノズル）",{"$f":"C8*0.96","v":{"v":1.3823999999999999,"d":"1.4"}},{"v":1.44,"d":"1.4"},1.5,{"v":0,"d":"0.0"},null,{"$f":"H8*0.96","v":{"v":1.56672,"d":"1.6"}},{"v":1.632,"d":"1.6"},1.7,{"v":0,"d":"0.0"},null,{"$f":"M8*0.96","v":{"v":1.93536,"d":"1.9"}},{"v":2.016,"d":"2.0"},2.1,{"v":0,"d":"0.0"},null,{"$f":"R8*0.96","v":{"v":2.304,"d":"2.3"}},2.4,2.5,{"v":0,"d":"0.0"},null,{"$f":"W8*0.96","v":{"v":2.85696,"d":"2.9"}},{"v":2.976,"d":"3.0"},3.1,{"v":0,"d":"0.0"},null,{"$f":"AB8*0.96","v":{"v":3.40992,"d":"3.4"}},{"v":3.552,"d":"3.6"},3.7,{"$nulls":3},{"v":116,"d":"116.0"},28,795,527]
["C1050HS（青森仕様ノズル）",{"v":1.2902399999999998,"d":"1.3"},{"v":1.3439999999999999,"d":"1.3"},1.4,{"v":0,"d":"0.0"},null,{"v":1.4745599999999999,"d":"1.5"},{"v":1.536,"d":"1.5"},1.6,{"v":0,"d":"0.0"},null,{"v":1.8432,"d":"1.8"},{"v":1.92,"d":"1.9"},{"v":2,"d":"2.0"},{"v":0,"d":"0.0"},null,{"v":2.11968,"d":"2.1"},{"v":2.2079999999999997,"d":"2.2"},2.3,{"v":0,"d":"0.0"},null,{"v":2.7647999999999997,"d":"2.8"},{"v":2.88,"d":"2.9"},{"v":3,"d":"3.0"},{"v":0,"d":"0.0"},null,{"v":3.13344,"d":"3.1"},{"v":3.264,"d":"3.3"},3.4,{"$nulls":3},{"v":116,"d":"116.0"},28,800,570]
["YE1051HC/YSE1051HC（青森仕様ノズル）",{"v":1.2902399999999998,"d":"1.3"},{"v":1.3439999999999999,"d":"1.3"},1.4,{"v":0,"d":"0.0"},null,{"v":1.56672,"d":"1.6"},{"v":1.632,"d":"1.6"},1.7,{"v":0,"d":"0.0"},null,{"v":1.93536,"d":"1.9"},{"v":2.016,"d":"2.0"},2.1,{"v":0,"d":"0.0"},null,{"v":2.2118399999999996,"d":"2.2"},{"v":2.304,"d":"2.3"},2.4,{"v":0,"d":"0.0"},null,{"v":2.7647999999999997,"d":"2.8"},{"v":2.88,"d":"2.9"},{"v":3,"d":"3.0"},{"v":0,"d":"0.0"},null,{"v":3.31776,"d":"3.3"},{"v":3.456,"d":"3.5"},3.6,{"$nulls":3},{"v":112,"d":"112.0"},28,825,550]
["C1061/FS1061/FSC1061(L)",{"v":1.4745599999999999,"d":"1.5"},{"$f":"D11*0.96","v":{"v":1.536,"d":"1.5"}},1.6,{"$f":"F11*0.96","v":{"v":0,"d":"0.0"}},null,{"v":2.67264,"d":"2.7"},{"$f":"I11*0.96","v":{"v":2.784,"d":"2.8"}},2.9,{"$f":"K11*0.96","v":{"v":0,"d":"0.0"}},null,{"v":1.7510399999999997,"d":"1.8"},{"$f":"N11*0.96","v":{"v":1.8239999999999998,"d":"1.8"}},1.9,{"$f":"P11*0.96","v":{"v":0,"d":"0.0"}},null,{"v":3.2255999999999996,"d":"3.2"},{"$f":"S11*0.96","v":{"v":3.36,"d":"3.4"}},3.5,{"$f":"U11*0.96","v":{"v":0,"d":"0.0"}},null,{"v":2.304,"d":"2.3"},{"$f":"X11*0.96","v":2.4},2.5,{"$f":"Z11*0.96","v":{"v":0,"d":"0.0"}},null,{"v":4.1472,"d":"4.1"},{"$f":"AC11*0.96","v":{"v":4.32,"d":"4.3"}},4.5,{"$f":"AE11*0.96","v":{"v":0,"d":"0.0"}},null,null,{"v":152,"d":"152.0"},36,900]
["CT1020（青森仕様ノズル）",{"$f":"C12*0.96","v":{"v":1.44,"d":"1.4"}},1.5,{"$f":"E12*0.96","v":{"v":0,"d":"0.0"}},{"$f":"F12*0.96","v":{"v":0,"d":"0.0"}},null,{"$f":"H12*0.96","v":{"v":0,"d":"0.0"}},{"v":0,"d":"0.0"},{"$f":"J12*0.96","v":{"v":0,"d":"0.0"}},{"$f":"K12*0.96","v":{"v":0,"d":"0.0"}},null,{"$f":"M12*0.96","v":{"v":2.1120000457763672,"d":"2.1"}},{"v":2.200000047683716,"d":"2.2"},{"$f":"O12*0.96","v":{"v":0,"d":"0.0"}},{"$f":"P12*0.96","v":{"v":0,"d":"0.0"}},null,{"$f":"R12*0.96","v":{"v":0,"d":"0.0"}},{"v":0,"d":"0.0"},{"$f":"T12*0.96","v":{"v":0,"d":"0.0"}},{"$f":"U12*0.96","v":{"v":0,"d":"0.0"}},null,{"$f":"W12*0.96","v":{"v":2.9759999084472657,"d":"3.0"}},{"v":3.0999999046325684,"d":"3.1"},{"$f":"Y12*0.96","v":{"v":0,"d":"0.0"}},{"$f":"Z12*0.96","v":{"v":0,"d":"0.0"}},null,{"$f":"AB12*0.96","v":{"v":0,"d":"0.0"}},{"v":0,"d":"0.0"},{"$f":"AD12*0.96","v":{"v":0,"d":"0.0"}},{"$f":"AE12*0.96","v":{"v":0,"d":"0.0"}},null,null,{"v":112,"d":"112.0"},28,825,547]
["FSC1060/FSC1060L(S)",{"v":1.536,"d":"1.5"},1.6,{"$f":"E13*0.96","v":{"v":0,"d":"0.0"}},{"$f":"F13*0.96","v":{"v":0,"d":"0.0"}},null,{"v":2.784,"d":"2.8"},2.9,{"$f":"J13*0.96","v":{"v":0,"d":"0.0"}},{"$f":"K13*0.96","v":{"v":0,"d":"0.0"}},null,{"v":1.8239999999999998,"d":"1.8"},1.9,{"$f":"O13*0.96","v":{"v":0,"d":"0.0"}},{"$f":"P13*0.96","v":{"v":0,"d":"0.0"}},null,{"v":3.36,"d":"3.4"},3.5,{"$f":"T13*0.96","v":{"v":0,"d":"0.0"}},{"$f":"U13*0.96","v":{"v":0,"d":"0.0"}},null,2.4,2.5,{"$f":"Y13*0.96","v":{"v":0,"d":"0.0"}},{"$f":"Z13*0.96","v":{"v":0,"d":"0.0"}},null,{"v":4.32,"d":"4.3"},4.5,{"$f":"AD13*0.96","v":{"v":0,"d":"0.0"}},{"$f":"AE13*0.96","v":{"v":0,"d":"0.0"}},null,null,{"v":155,"d":"155.0"},36,956]
["C1060/FS1060/C1033/FSC1033",{"v":1.632,"d":"1.6"},1.7,{"$f":"E14*0.96","v":{"v":0,"d":"0.0"}},{"$f":"F14*0.96","v":{"v":0,"d":"0.0"}},null,{"v":2.9375999999999998,"d":"2.9"},{"v":3.06,"d":"3.1"},{"$f":"J14*0.96","v":{"v":0,"d":"0.0"}},{"$f":"K14*0.96","v":{"v":0,"d":"0.0"}},null,{"v":1.9776,"d":"2.0"},{"v":2.06,"d":"2.1"},{"$f":"O14*0.96","v":{"v":0,"d":"0.0"}},{"$f":"P14*0.96","v":{"v":0,"d":"0.0"}},null,{"v":3.552,"d":"3.6"},3.7,{"$f":"T14*0.96","v":{"v":0,"d":"0.0"}},{"$f":"U14*0.96","v":{"v":0,"d":"0.0"}},null,{"v":2.3808,"d":"2.4"},{"v":2.48,"d":"2.5"},{"$f":"Y14*0.96","v":{"v":0,"d":"0.0"}},{"$f":"Z14*0.96","v":{"v":0,"d":"0.0"}},null,{"v":4.2912,"d":"4.3"},{"v":4.47,"d":"4.5"},{"$f":"AD14*0.96","v":{"v":0,"d":"0.0"}},{"$f":"AE14*0.96","v":{"v":0,"d":"0.0"}},null,null,{"v":155,"d":"155.0"},36,990]
["C524P/C624P（ミカン機仕様）",{"$f":"C15*0.96","v":{"v":1.536,"d":"1.5"}},1.6,{"$f":"E15*0.96","v":{"v":0,"d":"0.0"}},{"$f":"F15*0.96","v":{"v":0,"d":"0.0"}},null,{"$f":"H15*0.96","v":{"v":0,"d":"0.0"}},null,{"$f":"J15*0.96","v":{"v":0,"d":"0.0"}},{"$f":"K15*0.96","v":{"v":0,"d":"0.0"}},null,{"$f":"M15*0.96","v":{"v":2.112,"d":"2.1"}},2.2,{"$f":"O15*0.96","v":{"v":0,"d":"0.0"}},{"$f":"P15*0.96","v":{"v":0,"d":"0.0"}},null,{"$f":"R15*0.96","v":{"v":0,"d":"0.0"}},{"$f":"S15*0.96","v":{"v":0,"d":"0.0"}},{"$f":"T15*0.96","v":{"v":0,"d":"0.0"}},{"$f":"U15*0.96","v":{"v":0,"d":"0.0"}},null,{"$f":"W15*0.96","v":{"v":3.264,"d":"3.3"}},3.4,{"$f":"Y15*0.96","v":{"v":0,"d":"0.0"}},{"$f":"Z15*0.96","v":{"v":0,"d":"0.0"}},null,{"$f":"AB15*0.96","v":{"v":0,"d":"0.0"}},{"$f":"AC15*0.96","v":{"v":0,"d":"0.0"}},{"$f":"AD15*0.96","v":{"v":0,"d":"0.0"}},{"$f":"AE15*0.96","v":{"v":0,"d":"0.0"}},null,null,{"v":93,"d":"93.0"},24,560]
{"$rows_left_out":37}
{"sheet":"吐出量表","index":3,"n_rows":15,"n_cols":10,"rows_kept":15,"hidden":true}
[null,"1.0MPa","1.5Mpa","2.0MPa",null,"散布幅","走行距離（ｍ）"]
["Φ 0.8","0.66",0.81,0.93,null,"3m",333]
["Φ 1.0","1.53",1.85,2.12,null,"3.5m",285]
["Φ 1.2","1.85",2.23,2.55,null,"4m",250,null,"横(m)","=散布幅×２"]
["Φ 1.4","2.71",3.27,3.75,null,"4.5m",222,null,"縦(m)","=10a÷横幅(m)"]
["Φ 1.5","3.11",3.77,4.33,null,"5m",200,null,"走行距離","=縦×１（両側散布）+縦×２×1/2（片側散布）=縦×２往復"]
["Φ 0.8（広）","0.61",0.74,0.85,null,"5.6m",177,null,null,"=1000㎡÷（散布幅×2列）×2往復"]
["Φ 1.0（広）","1.14",1.38,1.59,null,"6m",167,null,null,"=1000÷散布幅"]
["Φ 1.2（広）","1.31",1.59,1.82,null,"6.5m",154]
["Φ 1.4（広）","1.80",2.18,2.47,null,"7m",143]
["Φ 1.5（広）","2.01",2.45,2.72,null,"7.5m",133]
["SV-23-40K","1.9","2.3",null,null,"8m",125]
["SV-30-55K","2.5","3.0"]
["CV1080","0.9","1.1"]
["CV1780",{"v":1.4,"d":"1.40"},{"v":1.8,"d":"1.80"}]
{"$rows_left_out":1}
{"sheet":"追加登録","index":4,"n_rows":23,"n_cols":6,"rows_kept":23,"hidden":true,"merged":[[3,3,3,6]]}
[null,"追加する製品データを入力後、「製品データ追加」ボタンをクリックしてください。"]
[]
[]
[null,"製品名",null,"CT1050H"]
[null,"エンジン定格回転数",null,2500,"rpm","←リストから選択（それ以外の回転数は対応不可）。"]
[null,"定格回転時車速","低-1",1.4,"km/h"]
[null,null,"中-1",1.7,"km/h","←副変速に「中」がない機種は、中-1～3は0にする。"]
[null,null,"低-2",2.1,"km/h"]
[null,null,"中-2",2.4,"km/h"]
[null,null,"低-3",3,"km/h"]
[null,null,"中-3",3.6,"km/h"]
[null,"噴霧ポンプ吐出量",null,112,"L/分","←カタログ値（余水考慮前）を入力する。"]
[null,"使用時風量","H側",825,"㎥/分","←風量切り替えがない機種はH側に入力する。"]
[null,null,"L側",550,"㎥/分"]
[null,"ノズル個数",null,28,"個"]
{"$rows_left_out":2}